{"text_format":"1","workbook":"xlsx","n_sheets":5,"sheets":["Gasanvändning","Rapport HBL","Substrat","Data","Egna Data"],"not_rendered":{"charts":0,"images":20,"macros":1,"external_links":1,"defined_names":18,"comments":3,"pivot_tables":0},"unopened":[],"bounds":{"document_bytes":16777216,"sheet_cells":100000,"rows_first":2000,"rows_last":500,"rows_between":2000,"halvings":0,"cell_chars":16384,"cell_head_chars":4096},"cells_cut":0,"cells_raw":0,"read":"whole","date_system":"1900"}

{"sheet":"Gasanvändning","index":0,"n_rows":194,"n_cols":40,"rows_kept":194,"cut":false,"hidden":false,"merged":[[1,37,4,37],[0,15,0,34],[1,15,2,16],[1,18,2,19],[1,21,2,22],[1,24,2,25],[3,15,4,16],[1,35,5,35],[1,17,6,17],[1,20,5,20],[1,36,6,36],[3,21,4,22],[3,24,4,25],[1,27,2,28],[1,31,1,32],[1,33,1,34],[159,7,159,11],[0,14,6,14],[3,18,4,19],[0,12,0,13],[3,0,5,10],[1,0,2,0],[1,1,2,2],[1,10,2,10],[0,1,0,2],[0,7,0,9],[0,3,0,6],[1,11,5,11],[1,3,2,9],[159,0,159,4],[158,0,158,4],[158,7,158,11],[3,30,3,31],[4,30,4,31],[5,30,5,31],[2,30,2,31],[3,27,4,28]]}
["HBK-El & Värme, ver 1.1","Företag:",null,"företagsnamn",null,null,null,"Rapportering för år:",null,null,2023,null,"Transport av gas",null,null,"Fördelning av gas på enheter i anläggningen",null,null,null,null,null,null,null,null,null,null,null,null,null,null,null,null,null,null,null,null,"Massbalans"]
["Datum när biobränsle började användas","20xx-xx-xx",null,{"$f":"IF(ISBLANK(B2),\"Datum måste anges\",IF(B2<=DATEVALUE(\"2020-12-31\"),\"Inget krav på växthusgasreduktion\",IF(AND(B2>DATEVALUE(\"2020-12-31\"),B2<=DATEVALUE(\"2025-12-31\")),\"Krav på 70% växthusgasreduktion\",IF(B2>DATEVALUE(\"2025-12-31\"),\"Krav på 80% växthusgasreduktion\",))))","v":"Krav på 80% växthusgasreduktion"},null,null,null,null,null,null,{"$f":"IF(B2<=DATEVALUE(\"2020-12-31\"),0,  IF(B2<=DATEVALUE(\"2025-12-31\"),1,  2))","v":2},null,"Transport, typ",null,null,"Värme-kyla, enhet 1",null,null,"Värme-kyla, enhet 2",null,null,"Värme-kyla, enhet 3",null,null,"Värme-kyla enhet 4",null,null,"Elproduktion",null,null,"Kraft-värme","Värme",null,"El"]
[null,null,null,null,null,null,null,null,null,null,null,null,"Bränsle",null,null,null,null,null,null,null,null,null,null,null,null,null,null,null,null,null,"Producerad mängd, MWh"]
["Inkommande gas ",null,null,null,null,null,null,null,null,null,null,null,"Avstånd, km",null,null,null,null,null,null,null,null,null,null,null,null,null,null,null,null,null,"Verkningsgrad, %"]
[null,null,null,null,null,null,null,null,null,null,null,null,"Antal trp",null,null,null,null,null,null,null,null,null,null,null,null,null,null,null,null,null,"Temperatur för nyttiggjord värme, grader C"]
[null,null,null,null,null,null,null,null,null,null,null,null,"Utsl, ton CO2eq",{"$f":"IF(N2<>\"\",IF(N2=\"Rörledning\",\"0\",VLOOKUP(N2,Data!$A$46:$B$60,2,FALSE)*VLOOKUP(N3,Data!$A$23:$C$44,3,FALSE)*N4*N5/1000/1000*2),\"\")","v":""},null,"Verkningsgrad, %",null,null,"Verkningsgrad, %",null,null,"Verkningsgrad, %",null,null,"Verkningsgrad, %",null,null,"Verkningsgrad, %",null,null,"Carnot effektivitet, ch",null,{"$f":"AG5/(AG5+273.15)","v":0}]
["Råvara / Substrat","Parti nr","Ursprung","Substrat, typ","Bränslekategori, \nGas / \nFlytande / annan","Mängd, Nm3 / kg (tusental)","Enhet, \nNm3 / kg","Värmevärde, MJ/enhet","Växthusgasutsläpp, CO2eq/MJ","Beräkning, F eller N, Esca om gödselbonus tillämpats","Certifiering","Parti nr","Mängd, kg/Nm3 (tusental)","Växthusgas-utsläpp, g CO2eq/MJ",null,"Mängd, kg/Nm3 (tusental)","Växthusgasutsläpp, g CO2eq/MJ",null,"Mängd, kg/Nm3 (tusental)","Växthusgasutsläpp, g CO2eq/MJ","Parti nr","Mängd, kg/Nm3 (tusental)","Växthusgasutsläpp, g CO2eq/MJ",null,"Mängd, kg/Nm3 (tusental)","Växthusgasutsläpp, g CO2eq/MJ","Parti nr","Mängd, kg/Nm3 (tusental)","Växthusgasutsläpp, g CO2eq/MJ",null,"Tillförd mängd gas, kg/Nm3 (tusental)","Gasmängd att rapportera, kg/Nm3 (tusental)","Växthusgasutsläpp, g CO2eq/MJ","Gasmängd att rapportera, kg/Nm3 (tusental)","Växthusgasutsläpp, g CO2eq/MJ",null,null,"Elproduktion",null,"Avvikelse In - ut, Nm3 / kg (tusental)"]
[]
["",1,"","","",null,null,null,null,"","",1,null,{"$f":"IF(AND(K$2>0,M9>0),Calc_Emissions(),\"\")","v":""},null,null,{"$f":"IF(P9>0, Calc_Conversion(Q$6),\"\")","v":""},null,null,{"$f":"IF(S9>0, Calc_Conversion(T$6),\"\")","v":""},1,null,{"$f":"IF(V9>0, Calc_Conversion(W$6),\"\")","v":""},null,null,{"$f":"IF(Y9>0, Calc_Conversion(Z$6),\"\")","v":""},1,null,{"$f":"IF(AB9>0, Calc_Conversion(AC$6),\"\")","v":""},null,null,{"$f":"IF(AND($A9<>\"\",AE9>0), AE9/($AG$3+$AI$3)*$AG$3, \"\")","v":""},{"$f":"IF(AE9>0, Calc_Conversion_elandheat(AG$4,  AG$6,   AG$4,  AG$6,  AI$4,  AG$4), \"\")","v":""},{"$f":"IF(AND($A9<>\"\",AE9>0), AE9/($AG$3+$AI$3)*$AI$3, \"\")","v":""},{"$f":"IF(AE9>0, Calc_Conversion_elandheat(AI$4,  1,   AI$4,  AG$6,  AG$4,  AI$4), \"\")","v":""},null,{"$f":"IF(A9<>\"\", (P9+S9+V9+Y9+AB9+AE9)-F9, \"\")","v":""},{"$f":"IF(A9<>\"\",#REF!,\"\")","v":""},null,{"$f":"IF(A9<>\"\",    IF(G9=\"Gas\", IF(H9=\"kg\", ((#REF!*Denscalc(I9) +#REF!+#REF!*Denscalc(I9)+#REF!)-F9), ( (#REF!+#REF!/Denscalc(I9) +#REF!+#REF!/Denscalc(I9))-F9)), ( (#REF!*   Denscalc(I9)+#REF!+AL9+#REF!*Denscalc(I9)+#REF!+#REF!)-F9)  ), \"\")","v":""}]
["",2,"","","",null,null,null,null,"","",2,null,{"$f":"IF(AND(K$2>0,M10>0),Calc_Emissions(),\"\")","v":""},null,null,{"$f":"IF(P10>0, Calc_Conversion(Q$6),\"\")","v":""},null,null,{"$f":"IF(S10>0, Calc_Conversion(T$6),\"\")","v":""},2,null,{"$f":"IF(V10>0, Calc_Conversion(W$6),\"\")","v":""},null,null,{"$f":"IF(Y10>0, Calc_Conversion(Z$6),\"\")","v":""},2,null,{"$f":"IF(AB10>0, Calc_Conversion(AC$6),\"\")","v":""},null,null,{"$f":"IF(AND($A10<>\"\",AE10>0), AE10/($AG$3+$AI$3)*$AG$3, \"\")","v":""},{"$f":"IF(AE10>0, Calc_Conversion_elandheat(AG$4,  AG$6,   AG$4,  AG$6,  AI$4,  AG$4), \"\")","v":""},{"$f":"IF(AND($A10<>\"\",AE10>0), AE10/($AG$3+$AI$3)*$AI$3, \"\")","v":""},{"$f":"IF(AE10>0, Calc_Conversion_elandheat(AI$4,  1,   AI$4,  AG$6,  AG$4,  AI$4), \"\")","v":""},null,{"$f":"IF(A10<>\"\", (P10+S10+V10+Y10+AB10+AE10)-F10, \"\")","v":""},{"$f":"IF(A10<>\"\",#REF!,\"\")","v":""},null,{"$f":"IF(A10<>\"\",    IF(G10=\"Gas\", IF(H10=\"kg\", ((#REF!*Denscalc(I10) +#REF!+#REF!*Denscalc(I10)+#REF!)-F10), ( (#REF!+#REF!/Denscalc(I10) +#REF!+#REF!/Denscalc(I10))-F10)), ( (#REF!*   Denscalc(I10)+#REF!+AL10+#REF!*Denscalc(I10)+#REF!+#REF!)-F10)  ), \"\")","v":""}]
["",3,"","","",null,null,null,null,"","",3,null,{"$f":"IF(AND(K$2>0,M11>0),Calc_Emissions(),\"\")","v":""},null,null,{"$f":"IF(P11>0, Calc_Conversion(Q$6),\"\")","v":""},null,null,{"$f":"IF(S11>0, Calc_Conversion(T$6),\"\")","v":""},3,null,{"$f":"IF(V11>0, Calc_Conversion(W$6),\"\")","v":""},null,null,{"$f":"IF(Y11>0, Calc_Conversion(Z$6),\"\")","v":""},3,null,{"$f":"IF(AB11>0, Calc_Conversion(AC$6),\"\")","v":""},null,null,{"$f":"IF(AND($A11<>\"\",AE11>0), AE11/($AG$3+$AI$3)*$AG$3, \"\")","v":""},{"$f":"IF(AE11>0, Calc_Conversion_elandheat(AG$4,  AG$6,   AG$4,  AG$6,  AI$4,  AG$4), \"\")","v":""},{"$f":"IF(AND($A11<>\"\",AE11>0), AE11/($AG$3+$AI$3)*$AI$3, \"\")","v":""},{"$f":"IF(AE11>0, Calc_Conversion_elandheat(AI$4,  1,   AI$4,  AG$6,  AG$4,  AI$4), \"\")","v":""},null,"",{"$f":"IF(A11<>\"\",#REF!,\"\")","v":""},null,{"$f":"IF(A11<>\"\",    IF(G11=\"Gas\", IF(H11=\"kg\", ((#REF!*Denscalc(I11) +#REF!+#REF!*Denscalc(I11)+#REF!)-F11), ( (#REF!+#REF!/Denscalc(I11) +#REF!+#REF!/Denscalc(I11))-F11)), ( (#REF!*   Denscalc(I11)+#REF!+AL11+#REF!*Denscalc(I11)+#REF!+#REF!)-F11)  ), \"\")","v":""}]
["",4,"","","",null,null,null,null,"","",4,null,{"$f":"IF(AND(K$2>0,M12>0),Calc_Emissions(),\"\")","v":""},null,null,{"$f":"IF(P12>0, Calc_Conversion(Q$6),\"\")","v":""},null,null,{"$f":"IF(S12>0, Calc_Conversion(T$6),\"\")","v":""},4,null,{"$f":"IF(V12>0, Calc_Conversion(W$6),\"\")","v":""},null,null,{"$f":"IF(Y12>0, Calc_Conversion(Z$6),\"\")","v":""},4,null,{"$f":"IF(AB12>0, Calc_Conversion(AC$6),\"\")","v":""},null,null,"",{"$f":"IF(AE12>0, Calc_Conversion_elandheat(AG$4,  AG$6,   AG$4,  AG$6,  AI$4,  AG$4), \"\")","v":""},"",{"$f":"IF(AE12>0, Calc_Conversion_elandheat(AI$4,  1,   AI$4,  AG$6,  AG$4,  AI$4), \"\")","v":""},null,"",{"$f":"IF(A12<>\"\",#REF!,\"\")","v":""},null,{"$f":"IF(A12<>\"\",    IF(G12=\"Gas\", IF(H12=\"kg\", ((#REF!*Denscalc(I12) +#REF!+#REF!*Denscalc(I12)+#REF!)-F12), ( (#REF!+#REF!/Denscalc(I12) +#REF!+#REF!/Denscalc(I12))-F12)), ( (#REF!*   Denscalc(I12)+#REF!+AL12+#REF!*Denscalc(I12)+#REF!+#REF!)-F12)  ), \"\")","v":""}]
["",5,"","","",null,null,null,null,"","",5,null,{"$f":"IF(AND(K$2>0,M13>0),Calc_Emissions(),\"\")","v":""},null,null,{"$f":"IF(P13>0, Calc_Conversion(Q$6),\"\")","v":""},null,null,{"$f":"IF(S13>0, Calc_Conversion(T$6),\"\")","v":""},5,null,{"$f":"IF(V13>0, Calc_Conversion(W$6),\"\")","v":""},null,null,{"$f":"IF(Y13>0, Calc_Conversion(Z$6),\"\")","v":""},5,null,{"$f":"IF(AB13>0, Calc_Conversion(AC$6),\"\")","v":""},null,null,"",{"$f":"IF(AE13>0, Calc_Conversion_elandheat(AG$4,  AG$6,   AG$4,  AG$6,  AI$4,  AG$4), \"\")","v":""},"",{"$f":"IF(AE13>0, Calc_Conversion_elandheat(AI$4,  1,   AI$4,  AG$6,  AG$4,  AI$4), \"\")","v":""},null,"",{"$f":"IF(A13<>\"\",#REF!,\"\")","v":""},null,{"$f":"IF(A13<>\"\",    IF(G13=\"Gas\", IF(H13=\"kg\", ((#REF!*Denscalc(I13) +#REF!+#REF!*Denscalc(I13)+#REF!)-F13), ( (#REF!+#REF!/Denscalc(I13) +#REF!+#REF!/Denscalc(I13))-F13)), ( (#REF!*   Denscalc(I13)+#REF!+AL13+#REF!*Denscalc(I13)+#REF!+#REF!)-F13)  ), \"\")","v":""}]
["",6,"","","",null,null,null,null,"","",6,null,{"$f":"IF(AND(K$2>0,M14>0),Calc_Emissions(),\"\")","v":""},null,null,{"$f":"IF(P14>0, Calc_Conversion(Q$6),\"\")","v":""},null,null,{"$f":"IF(S14>0, Calc_Conversion(T$6),\"\")","v":""},6,null,{"$f":"IF(V14>0, Calc_Conversion(W$6),\"\")","v":""},null,null,{"$f":"IF(Y14>0, Calc_Conversion(Z$6),\"\")","v":""},6,null,{"$f":"IF(AB14>0, Calc_Conversion(AC$6),\"\")","v":""},null,null,"",{"$f":"IF(AE14>0, Calc_Conversion_elandheat(AG$4,  AG$6,   AG$4,  AG$6,  AI$4,  AG$4), \"\")","v":""},"",{"$f":"IF(AE14>0, Calc_Conversion_elandheat(AI$4,  1,   AI$4,  AG$6,  AG$4,  AI$4), \"\")","v":""},null,"",{"$f":"IF(A14<>\"\",#REF!,\"\")","v":""},null,{"$f":"IF(A14<>\"\",    IF(G14=\"Gas\", IF(H14=\"kg\", ((#REF!*Denscalc(I14) +#REF!+#REF!*Denscalc(I14)+#REF!)-F14), ( (#REF!+#REF!/Denscalc(I14) +#REF!+#REF!/Denscalc(I14))-F14)), ( (#REF!*   Denscalc(I14)+#REF!+AL14+#REF!*Denscalc(I14)+#REF!+#REF!)-F14)  ), \"\")","v":""}]
["",7,"","","",null,null,null,null,"","",7,null,{"$f":"IF(AND(K$2>0,M15>0),Calc_Emissions(),\"\")","v":""},null,null,{"$f":"IF(P15>0, Calc_Conversion(Q$6),\"\")","v":""},null,null,{"$f":"IF(S15>0, Calc_Conversion(T$6),\"\")","v":""},7,null,{"$f":"IF(V15>0, Calc_Conversion(W$6),\"\")","v":""},null,null,{"$f":"IF(Y15>0, Calc_Conversion(Z$6),\"\")","v":""},7,null,{"$f":"IF(AB15>0, Calc_Conversion(AC$6),\"\")","v":""},null,null,"",{"$f":"IF(AE15>0, Calc_Conversion_elandheat(AG$4,  AG$6,   AG$4,  AG$6,  AI$4,  AG$4), \"\")","v":""},"",{"$f":"IF(AE15>0, Calc_Conversion_elandheat(AI$4,  1,   AI$4,  AG$6,  AG$4,  AI$4), \"\")","v":""},null,"",{"$f":"IF(A15<>\"\",#REF!,\"\")","v":""}]
["",8,"","","",null,null,null,null,"","",8,null,{"$f":"IF(AND(K$2>0,M16>0),Calc_Emissions(),\"\")","v":""},null,null,{"$f":"IF(P16>0, Calc_Conversion(Q$6),\"\")","v":""},null,null,{"$f":"IF(S16>0, Calc_Conversion(T$6),\"\")","v":""},8,null,{"$f":"IF(V16>0, Calc_Conversion(W$6),\"\")","v":""},null,null,{"$f":"IF(Y16>0, Calc_Conversion(Z$6),\"\")","v":""},8,null,{"$f":"IF(AB16>0, Calc_Conversion(AC$6),\"\")","v":""},null,null,"",{"$f":"IF(AE16>0, Calc_Conversion_elandheat(AG$4,  AG$6,   AG$4,  AG$6,  AI$4,  AG$4), \"\")","v":""},"",{"$f":"IF(AE16>0, Calc_Conversion_elandheat(AI$4,  1,   AI$4,  AG$6,  AG$4,  AI$4), \"\")","v":""},null,"",{"$f":"IF(A16<>\"\",#REF!,\"\")","v":""},null,{"$f":"IF(A16<>\"\",    IF(G16=\"Gas\", IF(H16=\"kg\", ((#REF!*Denscalc(I16) +#REF!+#REF!*Denscalc(I16)+#REF!)-F16), ( (#REF!+#REF!/Denscalc(I16) +#REF!+#REF!/Denscalc(I16))-F16)), ( (#REF!*   Denscalc(I16)+#REF!+AL16+#REF!*Denscalc(I16)+#REF!+#REF!)-F16)  ), \"\")","v":""}]
["",9,"","","",null,null,null,null,"","",9,null,{"$f":"IF(AND(K$2>0,M17>0),Calc_Emissions(),\"\")","v":""},null,null,{"$f":"IF(P17>0, Calc_Conversion(Q$6),\"\")","v":""},null,null,{"$f":"IF(S17>0, Calc_Conversion(T$6),\"\")","v":""},9,null,{"$f":"IF(V17>0, Calc_Conversion(W$6),\"\")","v":""},null,null,{"$f":"IF(Y17>0, Calc_Conversion(Z$6),\"\")","v":""},9,null,{"$f":"IF(AB17>0, Calc_Conversion(AC$6),\"\")","v":""},null,null,"",{"$f":"IF(AE17>0, Calc_Conversion_elandheat(AG$4,  AG$6,   AG$4,  AG$6,  AI$4,  AG$4), \"\")","v":""},"",{"$f":"IF(AE17>0, Calc_Conversion_elandheat(AI$4,  1,   AI$4,  AG$6,  AG$4,  AI$4), \"\")","v":""},null,"",{"$f":"IF(A17<>\"\",#REF!,\"\")","v":""},null,{"$f":"IF(A17<>\"\",    IF(G17=\"Gas\", IF(H17=\"kg\", ((#REF!*Denscalc(I17) +#REF!+#REF!*Denscalc(I17)+#REF!)-F17), ( (#REF!+#REF!/Denscalc(I17) +#REF!+#REF!/Denscalc(I17))-F17)), ( (#REF!*   Denscalc(I17)+#REF!+AL17+#REF!*Denscalc(I17)+#REF!+#REF!)-F17)  ), \"\")","v":""}]
["",10,"","","",null,null,null,null,"","",10,null,{"$f":"IF(AND(K$2>0,M18>0),Calc_Emissions(),\"\")","v":""},null,null,{"$f":"IF(P18>0, Calc_Conversion(Q$6),\"\")","v":""},null,null,{"$f":"IF(S18>0, Calc_Conversion(T$6),\"\")","v":""},10,null,{"$f":"IF(V18>0, Calc_Conversion(W$6),\"\")","v":""},null,null,{"$f":"IF(Y18>0, Calc_Conversion(Z$6),\"\")","v":""},10,null,{"$f":"IF(AB18>0, Calc_Conversion(AC$6),\"\")","v":""},null,null,"",{"$f":"IF(AE18>0, Calc_Conversion_elandheat(AG$4,  AG$6,   AG$4,  AG$6,  AI$4,  AG$4), \"\")","v":""},"",{"$f":"IF(AE18>0, Calc_Conversion_elandheat(AI$4,  1,   AI$4,  AG$6,  AG$4,  AI$4), \"\")","v":""},null,"",{"$f":"IF(A18<>\"\",#REF!,\"\")","v":""},null,{"$f":"IF(A18<>\"\",    IF(G18=\"Gas\", IF(H18=\"kg\", ((#REF!*Denscalc(I18) +#REF!+#REF!*Denscalc(I18)+#REF!)-F18), ( (#REF!+#REF!/Denscalc(I18) +#REF!+#REF!/Denscalc(I18))-F18)), ( (#REF!*   Denscalc(I18)+#REF!+AL18+#REF!*Denscalc(I18)+#REF!+#REF!)-F18)  ), \"\")","v":""}]
["",11,"","","",null,null,null,null,"","",11,null,{"$f":"IF(AND(K$2>0,M19>0),Calc_Emissions(),\"\")","v":""},null,null,{"$f":"IF(P19>0, Calc_Conversion(Q$6),\"\")","v":""},null,null,{"$f":"IF(S19>0, Calc_Conversion(T$6),\"\")","v":""},11,null,{"$f":"IF(V19>0, Calc_Conversion(W$6),\"\")","v":""},null,null,{"$f":"IF(Y19>0, Calc_Conversion(Z$6),\"\")","v":""},11,null,{"$f":"IF(AB19>0, Calc_Conversion(AC$6),\"\")","v":""},null,null,"",{"$f":"IF(AE19>0, Calc_Conversion_elandheat(AG$4,  AG$6,   AG$4,  AG$6,  AI$4,  AG$4), \"\")","v":""},"",{"$f":"IF(AE19>0, Calc_Conversion_elandheat(AI$4,  1,   AI$4,  AG$6,  AG$4,  AI$4), \"\")","v":""},null,"",{"$f":"IF(A19<>\"\",#REF!,\"\")","v":""},null,{"$f":"IF(A19<>\"\",    IF(G19=\"Gas\", IF(H19=\"kg\", ((#REF!*Denscalc(I19) +#REF!+#REF!*Denscalc(I19)+#REF!)-F19), ( (#REF!+#REF!/Denscalc(I19) +#REF!+#REF!/Denscalc(I19))-F19)), ( (#REF!*   Denscalc(I19)+#REF!+AL19+#REF!*Denscalc(I19)+#REF!+#REF!)-F19)  ), \"\")","v":""}]
["",12,"","","",null,null,null,null,"","",12,null,{"$f":"IF(AND(K$2>0,M20>0),Calc_Emissions(),\"\")","v":""},null,null,{"$f":"IF(P20>0, Calc_Conversion(Q$6),\"\")","v":""},null,null,{"$f":"IF(S20>0, Calc_Conversion(T$6),\"\")","v":""},12,null,{"$f":"IF(V20>0, Calc_Conversion(W$6),\"\")","v":""},null,null,{"$f":"IF(Y20>0, Calc_Conversion(Z$6),\"\")","v":""},12,null,{"$f":"IF(AB20>0, Calc_Conversion(AC$6),\"\")","v":""},null,null,"",{"$f":"IF(AE20>0, Calc_Conversion_elandheat(AG$4,  AG$6,   AG$4,  AG$6,  AI$4,  AG$4), \"\")","v":""},"",{"$f":"IF(AE20>0, Calc_Conversion_elandheat(AI$4,  1,   AI$4,  AG$6,  AG$4,  AI$4), \"\")","v":""},null,"",{"$f":"IF(A20<>\"\",#REF!,\"\")","v":""},null,{"$f":"IF(A20<>\"\",    IF(G20=\"Gas\", IF(H20=\"kg\", ((#REF!*Denscalc(I20) +#REF!+#REF!*Denscalc(I20)+#REF!)-F20), ( (#REF!+#REF!/Denscalc(I20) +#REF!+#REF!/Denscalc(I20))-F20)), ( (#REF!*   Denscalc(I20)+#REF!+AL20+#REF!*Denscalc(I20)+#REF!+#REF!)-F20)  ), \"\")","v":""}]
{"$rows_left_out":175}
{"sheet":"Rapport HBL","index":1,"n_rows":4,"n_cols":20,"rows_kept":4,"cut":false,"hidden":false,"merged":[[2,0,2,1],[2,2,2,5],[0,0,0,19],[1,0,1,1],[1,2,1,5]]}
["HBK-El & Värme, ver 1.1 - Underlag för rapportering enligt Hållbarhetslagen"]
["Företag:",null,{"$f":"Gasanvändning!D1","v":"företagsnamn"}]
["Rapportering för år:",null,{"$f":"Gasanvändning!K1","v":2023}]
["Bränsletyp","Bränslekategori","Anläggningens driftsättningsdatum","Användningsområde","Hållbar mängd","Enhet mängd","Effektivt värmevärde","Enhet värmevärde","Ange råvara, för mängder som ej har krav på minskade växthusgasutsläpp","Råvara vid krav på minskade växthusgasutsläpp","Råvarans ursprungsland","Restprodukt eller avfall","Livsmedel/fodergröda","Högrisk ILUC","Metod för bestämmande av växthusgasutsläpp","Produktionskedja","Växthusgasutsläpp g CO2e/MJ","VHG-bonus eb","VHG-bonus esca","Certifiering"]

{"sheet":"Substrat","index":2,"n_rows":312,"n_cols":4,"rows_kept":312,"cut":false,"hidden":false,"merged":[]}
["HBK-El & Värme, ver 1.1  - Substratlista"]
["Substrat / Råvara ( Samma som kategori)","Typ","Råvara vid ej krav på växthusgasminskning","Not"]
["Avfall från djurfodertillverkning","Avfall","Annan restprodukt eller avfall","Rester från tillverkning av foder till husdjur som nötkreatur, svin, fjäderfä, hund- och katt (hanteras i fast form)"]
["Avfall från livsmedelsindustri","Avfall","Annan restprodukt eller avfall","T ex skal från grönsaker, fiskrens, mejeriprodukter, läskedrycksrester, bröd, deg, grönsaker, rester från charkuteri och styckning samt färdig mat. Hanteras antingen i flytande form med tankbil eller i fast form med t ex med container "]
["Avloppsslam","Avfall","Annan restprodukt eller avfall","Inklusive slam från externa reningsverk utan rötkammare. "]
["Deponigas","Avfall","Annan restprodukt eller avfall","Metangas som utvinns från deponier"]
["Drank ","Avfall","Annan restprodukt eller avfall","Från tillverkning av sprit för human konsumtion eller för användning som motorbränsle. "]
["Grödrester","Avfall","Övrig agrobiomassa","Exempelvis halm (torkad och balad), blast från potatis eller sockerbetor"]
["Gödsel","Restp","Restprodukt från jordbruk","Fast eller flytande gödsel från nötkreatur, svin, fjäderfä och andra husdjur"]
["Industrislam","Avfall","Annan restprodukt eller avfall","Slam från rening av industriellt avloppsvatten/avloppsslam och verksamhetsslam, t.ex. fiberslam. "]
["Matavfall","Avfall","Annan restprodukt eller avfall","Källsorterat matavfall från hushåll, matavfall från restauranger och storkök samt matavfall från butiker"]
["Rester från spannmålshantering","Restp","Restprodukt från jordbruk","T ex sekunda spannmål och avrens etc"]
["Rester från biodieselproduktion","Restp","Annan restprodukt eller avfall"]
["Råglycerin","Restp","Annan restprodukt eller avfall","T ex från biodieseltillverkning"]
["Råtallolja","Restp","Annan restprodukt eller avfall","Råtallolja framställd från råtallsåpa, som utvinnes ur sulfatmassaindustrins restavlutar (svartlut) från kokprocesserna."]
["Slaktavfall","Avfall","Annan restprodukt eller avfall","T ex mag- och tarminnehåll, blod, fett och slam från reningsverk vid slakteri"]
["Avfall från naturvård","Avfall","Övrig agrobiomassa","Avser gräs och andra växter som skördats i samband med naturvårdsåtgärder, som till exempel från vägkanter grönområden etc. Lagrat som rundbalsensilage. Tillagd 2023-03-21"]
["Havre","Livsmedel/fodergröda","Övrig agrobiomassa"]
["Helsäd-Vete","Livsmedel/fodergröda","Övrig agrobiomassa","Kärna & halm, lagrat som ensilage"]
["Korn","Livsmedel/fodergröda","Övrig agrobiomassa","Torkad kärna"]
{"$rows_left_out":293}
{"sheet":"Data","index":3,"n_rows":60,"n_cols":5,"rows_kept":60,"cut":false,"hidden":false,"merged":[[0,0,0,4]]}
["HBK-El & Värme, ver 1.1  - Underlagsdata"]
["Allmänna data",null,null,null,"Kommentar"]
["Omräkningsfaktorer till CO2 eq CH4 (gram/gram)",25,null,null,"Energimyndighetens föreskrifter STEM2021:7"]
["Omräkningsfaktorer till CO2 eq N2O (gram/gram)",298,null,null,"Energimyndighetens föreskrifter STEM2021:7"]
["Densitet metan, kg/Nm3",0.71750000000000003,null,null,"Svenskt Gastekniskt Center (www.sgc.se)"]
["Energiinnehåll metan, MJ/Nm3",{"$f":"50*B5","v":35.875},null,null,"Biograce: 50,0 MJ/kg "]
["Energiinnehåll metan, MJ/kg",50,null,null,"Biograce: 50,0 MJ/kg "]
["Ef; Fossila motsvarigheten vid produktion av värme,  gCO2eq/MJ",80,null,null,"Energimyndighetens föreskrifter STEM2021:7"]
["Ef; Fossila motsvarigheten vid produktion av el,  gCO2eq/MJ",183,null,null,"Energimyndighetens föreskrifter STEM2021:7"]
["Krav på växthusgasminskning mellan 2021-01-01 och 2025-12-31",0.7]
["Krav på växthusgasminskning mellan 2021-01-01 och 2025-12-31",0.8]
["Ja",null,null,null,"För val av Ja / Nej - alternativ"]
["Nej",null,null,null,"För val av Ja / Nej - alternativ"]
["Nm3",null,null,null,"För val av kg/Nm3 - alternativ"]
["kg",null,null,null,"För val av kg/Nm3 - alternativ"]
["Datum 1 för krav på växthusgasminskning","2020-12-31",null,null,"Före detta datum inget krav. Mellan datum 1 och 2, 70% minskning"]
["Datum 2 för krav på växthusgasminskning","2025-12-31",null,null,"Efter detta datum krav på 80% minskning"]
["Gränsvärde för varning för avvikelse i massbalans",0.05,null,null,"Detta värde används vid kontroll av massbalans i distributionsbladet. Vid större avvikelse rödmarkeras avvikelsen för partiet"]
["Visa välkomstsida","Ja"]
["Elektricitet","gCO2eq/MWh","gCO2eq/MJ",null,"Kommentar"]
{"$rows_left_out":41}
{"sheet":"Egna Data","index":4,"n_rows":1,"n_cols":1,"rows_kept":1,"cut":false,"hidden":false,"merged":[[0,0,0,13]]}
["HBK-El & Värme, ver 1.1  - Egna data, blad 1"]